{"text_format":"1","workbook":"xlsx","n_sheets":5,"sheets":["Instructions","ND-CPA-305","Table 1","Photos Sheet","ND-Frost Dates"],"not_rendered":{"charts":0,"images":0,"macros":1,"external_links":0,"defined_names":4,"comments":1,"pivot_tables":0},"unopened":[],"bounds":{"document_bytes":16777216,"sheet_cells":100000,"rows_first":2000,"rows_last":500,"rows_between":2000,"halvings":0,"cell_chars":16384,"cell_head_chars":4096},"cells_cut":0,"cells_raw":0,"read":"whole","date_system":"1900"}

{"sheet":"Instructions","index":0,"n_rows":63,"n_cols":1,"rows_kept":63,"cut":false,"hidden":false,"merged":[[0,0,0,8],[13,0,13,8],[56,0,56,8],[36,0,36,8],[38,0,38,8],[23,0,23,8],[44,0,44,8],[40,0,40,8],[21,0,21,8],[48,0,48,8],[50,0,50,8],[52,0,52,8],[27,0,27,8],[42,0,42,8],[62,0,62,8],[3,0,3,8],[5,0,5,8],[7,0,7,8],[11,0,11,8],[9,0,9,8],[17,0,17,8],[19,0,19,8],[60,0,60,8]]}
["Instructions for the ND-CPA-305 Cover Crop Design Workbook"]
[]
["Cover Crop Design Worksheet"]
["The sheet is set up to enter data required for documentation or design in the yellow-colored cells.  Blue colored cells are for optional documentation that may be helpful to report or track data."]
[]
["The sheet is protected and includes some choice lists, look up functions and calculations to assist the planner in designing a successful cover crop planting."]
[]
["You can move thru the worksheet with the {TAB} key, hitting {ENTER} after data entry or with the mouse by clicking on the cell that you want to work in."]
[]
["There are a number of help comments noted with the small red triangle in the upper right-hand corner of a cell."]
[]
["The ND-CPA-305 will print out on two pages, the Cover Crop Design Worksheet and the Cover Crop Certification Worksheet."]
[]
["You may save the ND-CPA-305 to the producer file as needed.  This is optional, based on the Areas guidance and/or the DC's discretion.  Perform a Save As function so you do not overwrite the workbook."]
[]
{"$rows_left_out":49}
{"sheet":"ND-CPA-305","index":1,"n_rows":154,"n_cols":47,"rows_kept":154,"cut":false,"hidden":false,"merged":[[4,1,4,4],[62,3,62,4],[62,0,62,2],[58,1,58,2],[67,0,67,2],[68,0,68,2],[72,0,72,2],[73,0,73,2],[69,0,69,2],[70,0,70,2],[71,0,71,2],[61,0,61,13],[64,3,64,4],[65,3,65,4],[68,11,68,13],[65,7,65,9],[24,2,24,6],[24,7,24,12],[19,3,19,6],[16,2,16,9],[43,12,43,13],[26,0,26,1],[26,4,26,6],[26,7,26,9],[73,11,73,12],[66,10,66,13],[71,7,72,13],[70,7,70,13],[73,7,73,8],[73,9,73,10],[69,10,69,13],[66,0,66,2],[65,0,65,2],[108,20,110,20],[109,41,111,45],[32,14,33,14],[79,7,79,13],[32,3,33,3],[36,10,36,11],[35,4,35,5],[34,10,34,11],[35,10,35,11],[81,0,86,13],[79,3,79,4],[76,0,76,2],[76,3,76,4],[77,0,77,2],[77,3,77,4],[78,0,78,2],[78,3,78,4],[74,3,74,4],[75,3,75,4],[78,5,78,6],[74,5,74,6],[63,7,63,10],[63,5,63,6],[64,5,64,6],[65,5,65,6],[57,1,57,5],[37,12,37,13],[39,10,39,11],[38,8,38,9],[32,10,33,11],[43,4,43,5],[32,4,33,5],[44,8,44,9],[41,12,41,13],[42,4,42,5],[41,10,41,11],[42,10,42,11],[46,4,46,7],[76,5,76,6],[80,7,80,9],[80,10,80,13],[67,11,67,12],[71,3,71,4],[69,3,69,4],[68,5,68,6],[69,5,69,6],[66,5,66,6],[67,5,67,6],[66,3,66,4],[72,3,72,4],[70,3,70,4],[70,5,70,6],[71,5,71,6],[78,10,78,12],[77,5,77,6],[73,5,73,6],[75,5,75,6],[69,7,69,9],[76,11,76,13],[74,7,75,13],[64,10,64,13],[65,10,65,13],[67,3,67,4],[68,3,68,4],[0,0,0,13],[12,5,12,6],[13,5,13,6],[14,5,14,6],[4,7,4,9],[29,4,29,7],[40,12,40,13],[20,3,20,6],[21,3,21,6],[22,3,22,6],[5,1,5,2],[21,0,21,2],[22,0,22,2],[36,4,36,5],[32,0,33,0],[32,1,33,1],[31,0,31,13],[37,8,37,9],[38,12,38,13],[39,12,39,13],[25,0,25,1],[16,11,16,13],[3,1,3,4],[9,5,9,6],[10,5,10,6],[11,5,11,6],[14,1,14,4],[29,2,29,3],[28,4,28,6],[17,0,17,1],[28,0,28,1],[29,0,29,1],[3,7,3,8],[5,7,5,8],[19,7,19,10],[20,7,20,10],[21,7,21,10],[22,7,22,10],[18,0,19,1],[15,1,15,3],[15,5,15,6],[17,7,17,10],[25,7,25,9],[26,10,26,12],[63,3,63,4],[62,5,62,6],[52,2,52,6],[53,2,53,6],[49,0,50,13],[51,0,51,13],[43,10,43,11],[43,8,43,9],[29,8,29,10],[47,0,47,1],[37,10,37,11],[35,8,35,9],[40,4,40,5],[37,4,37,5],[39,8,39,9],[34,4,34,5],[38,10,38,11],[41,8,41,9],[40,8,40,9],[41,4,41,5],[44,4,44,5],[42,8,42,9],[38,4,38,5],[39,4,39,5],[56,10,56,13],[56,1,56,6],[56,7,56,9],[57,7,57,9],[58,6,58,9],[36,12,36,13],[58,10,58,13],[42,12,42,13],[45,12,45,13],[40,10,40,11],[36,8,36,9],[46,8,46,9],[28,7,28,10],[44,12,44,13],[25,4,25,6],[45,4,45,5],[34,8,34,9],[32,8,33,9],[28,2,28,3],[35,12,35,13],[34,12,34,13],[32,2,33,2],[32,6,33,6],[32,12,33,13],[32,7,33,7],[25,10,25,12],[25,2,25,3],[26,2,26,3],[112,42,112,43],[112,44,112,45],[44,10,44,11],[88,5,89,9],[94,0,95,3],[94,5,95,9],[88,0,89,3],[73,3,73,4],[75,0,75,2],[74,0,74,2],[107,18,110,18],[107,19,110,19],[107,16,110,16],[107,17,110,17],[54,0,54,13],[67,7,67,10],[62,7,62,13],[57,10,57,13],[59,10,59,11],[72,5,72,6],[45,8,45,9],[45,10,45,11],[64,0,64,2],[63,0,63,2]]}
["Cover Crop Design Worksheet"]
["Note: Yellow areas indicate required data.  Blue areas indicate optional data."]
[]
["Name:",null,null,null,null,null,"Program:",null,null,null,null,null,"Quarter:"]
["Address:",null,null,null,null,null,"Contract #:",null,null,null,null,null,"Section:"]
["Field Number:",null,null,null,null,null,"CIN:",null,null,null,null,null,"Township:"]
["Irrigated: ",null,null,null,null,null,"Acres:",null,null,null,null,null,"Range:"]
["Indicate the decision-maker's objective(s) for applying cover crop, with an \"X\" beside each purpose:"]
[]
[null,"Reduce Erosion / Particulates",null,null,null,null,null,"Provide Supplemental Hay"]
[null,"Crop Abrasion / Blow-out *",null,null,null,null,null,"Provide Supplemental Grazing"]
[null,"Biological Nitrogen fixation",null,null,null,null,null,"Soil Moisture (conservation or utilization)"]
[null,"Pest Suppression",null,null,null,null,null,"Attract Beneficial Insects"]
[null,"Increase Soil Organic Matter ",null,null,null,null,null,"Minimize and Reduce Soil Compaction"]
[null,"Improve Soil Structure/Biodiversity",null,null,null,null,null,"Capture, Recycle, Redistribute Nutrients"]
{"$rows_left_out":140}
{"sheet":"Table 1","index":2,"n_rows":66,"n_cols":39,"rows_kept":66,"cut":false,"hidden":false,"merged":[[0,0,0,18],[46,0,46,6],[46,8,46,11],[46,13,46,17],[65,0,65,18]]}
["Table 1: Cover Crop - Common Species and Properties"]
["Cover Crop","Erosion Reduction","Increase soil organic matter ","Capture, recycle, redistri-bute nutrients in the soil profile","Promote biologi-cal nitrogen fixation ","Weed suppres-sion","Provide supple-mental hay","Provide supple-mental grazing","Rooting Depth / Plant Water Use /1","Minimize / reduce soil compaction","Seed size (Large or Fine)","Crop Type /2","Seeding rate, lbs/acre","Seeding depth, inches","Salinity tolerance","C:N Ratio ","Attract Beneficial Insects","Mycorrhizal fungi association ","Tolerance to Frost ",null,"Erosion Reduction","Increase soil organic matter ","Capture, recycle, redistribute nutrients in the soil profile","Promote biological nitrogen fixation ","Pest suppression","Provide supple-mental hay","Provide supple-mental grazing","Rooting Depth / Plant Water Use /1","Minimize / reduce soil compaction","Seed size (Large or Fine)","Crop Type /2","Seeding rate, lbs/acre","Seeding depth, inches","Salinity tolerance","C:N Ratio ","Attract Beneficial Insects","Mycorrhizal fungi association ","Tolerance to Frost "]
[null,1,2,3,4,5,6,7,8,9,10,11,12,13,14,15,16,17,18,null,"a10","a14","f15","a12","a13","f10","f11",null,"f14",null,null,null,null,"a17",null,"f13","a15","f16"]
["annual ryegrass","G","G","G","P","G","F","F","SM","P","F","CG",5,"0.25 - 1.0","G","H","N","F","P",{"$f":"AM4","v":0},{"$f":"IF('ND-CPA-305'!$A$10=\"X\",IF(B4=\"G\",3,IF(B4=\"F\",2,1)),0)","v":0},{"$f":"IF('ND-CPA-305'!$A$14=\"X\",IF(C4=\"G\",3,IF(C4=\"F\",2,1)),0)","v":0},{"$f":"IF('ND-CPA-305'!$F$15=\"X\",IF(D4=\"G\",3,IF(D4=\"F\",2,1)),0)","v":0},{"$f":"IF('ND-CPA-305'!$A$12=\"X\",IF(E4=\"G\",3,IF(E4=\"F\",2,1)),0)","v":0},{"$f":"IF('ND-CPA-305'!$A$13=\"X\",IF(F4=\"G\",3,IF(F4=\"F\",2,1)),0)","v":0},{"$f":"IF('ND-CPA-305'!$F$10=\"X\",IF(G4=\"G\",3,IF(G4=\"F\",2,1)),0)","v":0},{"$f":"IF('ND-CPA-305'!$F$11=\"X\",IF(H4=\"G\",3,IF(H4=\"F\",2,1)),0)","v":0},null,{"$f":"IF('ND-CPA-305'!$F$14=\"X\",IF(J4=\"G\",3,IF(J4=\"F\",2,1)),0)","v":0},null,null,null,null,{"$f":"IF('ND-CPA-305'!$A$16=\"X\",IF(O4=\"G\",3,IF(O4=\"F\",2,1)),0)","v":0},null,{"$f":"IF('ND-CPA-305'!$F$13=\"X\",IF(Q4=\"Y\",3,0),0)","v":0},{"$f":"IF('ND-CPA-305'!$A$15=\"X\",IF(R4=\"G\",3,IF(R4=\"F\",2,1)),0)","v":0},{"$f":"IF('ND-CPA-305'!$F$16=\"X\",IF(S4=\"G\",3,IF(S4=\"F\",2,1)),0)","v":0},{"$f":"SUM(U4:AL4)","v":0}]
["barley","G","G","F","P","G","F","F","MM","F","L","CG",48,"0.75 - 2.0","G","M","N","P","P",0,{"$f":"IF('ND-CPA-305'!$A$10=\"X\",IF(B5=\"G\",3,IF(B5=\"F\",2,1)),0)","v":0},{"$f":"IF('ND-CPA-305'!$A$14=\"X\",IF(C5=\"G\",3,IF(C5=\"F\",2,1)),0)","v":0},{"$f":"IF('ND-CPA-305'!$F$15=\"X\",IF(D5=\"G\",3,IF(D5=\"F\",2,1)),0)","v":0},{"$f":"IF('ND-CPA-305'!$A$12=\"X\",IF(E5=\"G\",3,IF(E5=\"F\",2,1)),0)","v":0},{"$f":"IF('ND-CPA-305'!$A$13=\"X\",IF(F5=\"G\",3,IF(F5=\"F\",2,1)),0)","v":0},{"$f":"IF('ND-CPA-305'!$F$10=\"X\",IF(G5=\"G\",3,IF(G5=\"F\",2,1)),0)","v":0},{"$f":"IF('ND-CPA-305'!$F$11=\"X\",IF(H5=\"G\",3,IF(H5=\"F\",2,1)),0)","v":0},null,{"$f":"IF('ND-CPA-305'!$F$14=\"X\",IF(J5=\"G\",3,IF(J5=\"F\",2,1)),0)","v":0},null,null,null,null,{"$f":"IF('ND-CPA-305'!$A$16=\"X\",IF(O5=\"G\",3,IF(O5=\"F\",2,1)),0)","v":0},null,{"$f":"IF('ND-CPA-305'!$F$13=\"X\",IF(Q5=\"Y\",3,0),0)","v":0},{"$f":"IF('ND-CPA-305'!$A$15=\"X\",IF(R5=\"G\",3,IF(R5=\"F\",2,1)),0)","v":0},{"$f":"IF('ND-CPA-305'!$F$16=\"X\",IF(S5=\"G\",3,IF(S5=\"F\",2,1)),0)","v":0},{"$f":"SUM(U5:AL5)","v":0}]
["berseem clover","P","P","F","G","F","F","G","MH","F","F","CB",4,"0.25 - 1.0","F","L","Y","P","P",0,{"$f":"IF('ND-CPA-305'!$A$10=\"X\",IF(B6=\"G\",3,IF(B6=\"F\",2,1)),0)","v":0},{"$f":"IF('ND-CPA-305'!$A$14=\"X\",IF(C6=\"G\",3,IF(C6=\"F\",2,1)),0)","v":0},{"$f":"IF('ND-CPA-305'!$F$15=\"X\",IF(D6=\"G\",3,IF(D6=\"F\",2,1)),0)","v":0},{"$f":"IF('ND-CPA-305'!$A$12=\"X\",IF(E6=\"G\",3,IF(E6=\"F\",2,1)),0)","v":0},{"$f":"IF('ND-CPA-305'!$A$13=\"X\",IF(F6=\"G\",3,IF(F6=\"F\",2,1)),0)","v":0},{"$f":"IF('ND-CPA-305'!$F$10=\"X\",IF(G6=\"G\",3,IF(G6=\"F\",2,1)),0)","v":0},{"$f":"IF('ND-CPA-305'!$F$11=\"X\",IF(H6=\"G\",3,IF(H6=\"F\",2,1)),0)","v":0},null,{"$f":"IF('ND-CPA-305'!$F$14=\"X\",IF(J6=\"G\",3,IF(J6=\"F\",2,1)),0)","v":0},null,null,null,null,{"$f":"IF('ND-CPA-305'!$A$16=\"X\",IF(O6=\"G\",3,IF(O6=\"F\",2,1)),0)","v":0},null,{"$f":"IF('ND-CPA-305'!$F$13=\"X\",IF(Q6=\"Y\",3,0),0)","v":0},{"$f":"IF('ND-CPA-305'!$A$15=\"X\",IF(R6=\"G\",3,IF(R6=\"F\",2,1)),0)","v":0},{"$f":"IF('ND-CPA-305'!$F$16=\"X\",IF(S6=\"G\",3,IF(S6=\"F\",2,1)),0)","v":0},0]
["buckwheat","G","F","G","P","G","P","P","SL","P","F","WB",48,"0.5 - 1.5","P","L","Y","P","P",0,{"$f":"IF('ND-CPA-305'!$A$10=\"X\",IF(B7=\"G\",3,IF(B7=\"F\",2,1)),0)","v":0},{"$f":"IF('ND-CPA-305'!$A$14=\"X\",IF(C7=\"G\",3,IF(C7=\"F\",2,1)),0)","v":0},{"$f":"IF('ND-CPA-305'!$F$15=\"X\",IF(D7=\"G\",3,IF(D7=\"F\",2,1)),0)","v":0},{"$f":"IF('ND-CPA-305'!$A$12=\"X\",IF(E7=\"G\",3,IF(E7=\"F\",2,1)),0)","v":0},{"$f":"IF('ND-CPA-305'!$A$13=\"X\",IF(F7=\"G\",3,IF(F7=\"F\",2,1)),0)","v":0},{"$f":"IF('ND-CPA-305'!$F$10=\"X\",IF(G7=\"G\",3,IF(G7=\"F\",2,1)),0)","v":0},{"$f":"IF('ND-CPA-305'!$F$11=\"X\",IF(H7=\"G\",3,IF(H7=\"F\",2,1)),0)","v":0},null,{"$f":"IF('ND-CPA-305'!$F$14=\"X\",IF(J7=\"G\",3,IF(J7=\"F\",2,1)),0)","v":0},null,null,null,null,{"$f":"IF('ND-CPA-305'!$A$16=\"X\",IF(O7=\"G\",3,IF(O7=\"F\",2,1)),0)","v":0},null,{"$f":"IF('ND-CPA-305'!$F$13=\"X\",IF(Q7=\"Y\",3,0),0)","v":0},{"$f":"IF('ND-CPA-305'!$A$15=\"X\",IF(R7=\"G\",3,IF(R7=\"F\",2,1)),0)","v":0},{"$f":"IF('ND-CPA-305'!$F$16=\"X\",IF(S7=\"G\",3,IF(S7=\"F\",2,1)),0)","v":0},0]
["canola","F","F","G","P","P-G**","F","F","MM","G","F","CB",5,"0.25 - 0.75","G","L","Y","P","P",0,{"$f":"IF('ND-CPA-305'!$A$10=\"X\",IF(B8=\"G\",3,IF(B8=\"F\",2,1)),0)","v":0},{"$f":"IF('ND-CPA-305'!$A$14=\"X\",IF(C8=\"G\",3,IF(C8=\"F\",2,1)),0)","v":0},{"$f":"IF('ND-CPA-305'!$F$15=\"X\",IF(D8=\"G\",3,IF(D8=\"F\",2,1)),0)","v":0},{"$f":"IF('ND-CPA-305'!$A$12=\"X\",IF(E8=\"G\",3,IF(E8=\"F\",2,1)),0)","v":0},{"$f":"IF('ND-CPA-305'!$A$13=\"X\",IF(F8=\"G\",3,IF(F8=\"F\",2,1)),0)","v":0},{"$f":"IF('ND-CPA-305'!$F$10=\"X\",IF(G8=\"G\",3,IF(G8=\"F\",2,1)),0)","v":0},{"$f":"IF('ND-CPA-305'!$F$11=\"X\",IF(H8=\"G\",3,IF(H8=\"F\",2,1)),0)","v":0},null,{"$f":"IF('ND-CPA-305'!$F$14=\"X\",IF(J8=\"G\",3,IF(J8=\"F\",2,1)),0)","v":0},null,null,null,null,{"$f":"IF('ND-CPA-305'!$A$16=\"X\",IF(O8=\"G\",3,IF(O8=\"F\",2,1)),0)","v":0},null,{"$f":"IF('ND-CPA-305'!$F$13=\"X\",IF(Q8=\"Y\",3,0),0)","v":0},{"$f":"IF('ND-CPA-305'!$A$15=\"X\",IF(R8=\"G\",3,IF(R8=\"F\",2,1)),0)","v":0},{"$f":"IF('ND-CPA-305'!$F$16=\"X\",IF(S8=\"G\",3,IF(S8=\"F\",2,1)),0)","v":0},0]
["chickling vetch","F","F","F","G","P","F","F","DM","F","L","CB",50,"1.5 - 3.0","P","L","Y","P","P",0,{"$f":"IF('ND-CPA-305'!$A$10=\"X\",IF(B9=\"G\",3,IF(B9=\"F\",2,1)),0)","v":0},{"$f":"IF('ND-CPA-305'!$A$14=\"X\",IF(C9=\"G\",3,IF(C9=\"F\",2,1)),0)","v":0},{"$f":"IF('ND-CPA-305'!$F$15=\"X\",IF(D9=\"G\",3,IF(D9=\"F\",2,1)),0)","v":0},{"$f":"IF('ND-CPA-305'!$A$12=\"X\",IF(E9=\"G\",3,IF(E9=\"F\",2,1)),0)","v":0},{"$f":"IF('ND-CPA-305'!$A$13=\"X\",IF(F9=\"G\",3,IF(F9=\"F\",2,1)),0)","v":0},{"$f":"IF('ND-CPA-305'!$F$10=\"X\",IF(G9=\"G\",3,IF(G9=\"F\",2,1)),0)","v":0},{"$f":"IF('ND-CPA-305'!$F$11=\"X\",IF(H9=\"G\",3,IF(H9=\"F\",2,1)),0)","v":0},null,{"$f":"IF('ND-CPA-305'!$F$14=\"X\",IF(J9=\"G\",3,IF(J9=\"F\",2,1)),0)","v":0},null,null,null,null,{"$f":"IF('ND-CPA-305'!$A$16=\"X\",IF(O9=\"G\",3,IF(O9=\"F\",2,1)),0)","v":0},null,{"$f":"IF('ND-CPA-305'!$F$13=\"X\",IF(Q9=\"Y\",3,0),0)","v":0},{"$f":"IF('ND-CPA-305'!$A$15=\"X\",IF(R9=\"G\",3,IF(R9=\"F\",2,1)),0)","v":0},{"$f":"IF('ND-CPA-305'!$F$16=\"X\",IF(S9=\"G\",3,IF(S9=\"F\",2,1)),0)","v":0},0]
["common vetch","F","F","F","G","G","G","G","SH","F","L","CB",20,"1.0 - 1.5","F","L","Y","P","P",0,{"$f":"IF('ND-CPA-305'!$A$10=\"X\",IF(B10=\"G\",3,IF(B10=\"F\",2,1)),0)","v":0},{"$f":"IF('ND-CPA-305'!$A$14=\"X\",IF(C10=\"G\",3,IF(C10=\"F\",2,1)),0)","v":0},{"$f":"IF('ND-CPA-305'!$F$15=\"X\",IF(D10=\"G\",3,IF(D10=\"F\",2,1)),0)","v":0},{"$f":"IF('ND-CPA-305'!$A$12=\"X\",IF(E10=\"G\",3,IF(E10=\"F\",2,1)),0)","v":0},{"$f":"IF('ND-CPA-305'!$A$13=\"X\",IF(F10=\"G\",3,IF(F10=\"F\",2,1)),0)","v":0},{"$f":"IF('ND-CPA-305'!$F$10=\"X\",IF(G10=\"G\",3,IF(G10=\"F\",2,1)),0)","v":0},{"$f":"IF('ND-CPA-305'!$F$11=\"X\",IF(H10=\"G\",3,IF(H10=\"F\",2,1)),0)","v":0},null,{"$f":"IF('ND-CPA-305'!$F$14=\"X\",IF(J10=\"G\",3,IF(J10=\"F\",2,1)),0)","v":0},null,null,null,null,{"$f":"IF('ND-CPA-305'!$A$16=\"X\",IF(O10=\"G\",3,IF(O10=\"F\",2,1)),0)","v":0},null,{"$f":"IF('ND-CPA-305'!$F$13=\"X\",IF(Q10=\"Y\",3,0),0)","v":0},{"$f":"IF('ND-CPA-305'!$A$15=\"X\",IF(R10=\"G\",3,IF(R10=\"F\",2,1)),0)","v":0},{"$f":"IF('ND-CPA-305'!$F$16=\"X\",IF(S10=\"G\",3,IF(S10=\"F\",2,1)),0)","v":0},0]
["corn","G","G","G","P","P-G**","F","F","DH","G","L","WG",25,"1.0 -1.5","P","H","N","G","P",0,{"$f":"IF('ND-CPA-305'!$A$10=\"X\",IF(B11=\"G\",3,IF(B11=\"F\",2,1)),0)","v":0},{"$f":"IF('ND-CPA-305'!$A$14=\"X\",IF(C11=\"G\",3,IF(C11=\"F\",2,1)),0)","v":0},{"$f":"IF('ND-CPA-305'!$F$15=\"X\",IF(D11=\"G\",3,IF(D11=\"F\",2,1)),0)","v":0},{"$f":"IF('ND-CPA-305'!$A$12=\"X\",IF(E11=\"G\",3,IF(E11=\"F\",2,1)),0)","v":0},{"$f":"IF('ND-CPA-305'!$A$13=\"X\",IF(F11=\"G\",3,IF(F11=\"F\",2,1)),0)","v":0},{"$f":"IF('ND-CPA-305'!$F$10=\"X\",IF(G11=\"G\",3,IF(G11=\"F\",2,1)),0)","v":0},{"$f":"IF('ND-CPA-305'!$F$11=\"X\",IF(H11=\"G\",3,IF(H11=\"F\",2,1)),0)","v":0},null,{"$f":"IF('ND-CPA-305'!$F$14=\"X\",IF(J11=\"G\",3,IF(J11=\"F\",2,1)),0)","v":0},null,null,null,null,{"$f":"IF('ND-CPA-305'!$A$16=\"X\",IF(O11=\"G\",3,IF(O11=\"F\",2,1)),0)","v":0},null,{"$f":"IF('ND-CPA-305'!$F$13=\"X\",IF(Q11=\"Y\",3,0),0)","v":0},{"$f":"IF('ND-CPA-305'!$A$15=\"X\",IF(R11=\"G\",3,IF(R11=\"F\",2,1)),0)","v":0},{"$f":"IF('ND-CPA-305'!$F$16=\"X\",IF(S11=\"G\",3,IF(S11=\"F\",2,1)),0)","v":0},0]
["cowpea","P","P","F","G","G","F","F","SL","F","L","WB",50,"1.0 - 1.5","P","L","Y","F","P",0,{"$f":"IF('ND-CPA-305'!$A$10=\"X\",IF(B12=\"G\",3,IF(B12=\"F\",2,1)),0)","v":0},{"$f":"IF('ND-CPA-305'!$A$14=\"X\",IF(C12=\"G\",3,IF(C12=\"F\",2,1)),0)","v":0},{"$f":"IF('ND-CPA-305'!$F$15=\"X\",IF(D12=\"G\",3,IF(D12=\"F\",2,1)),0)","v":0},{"$f":"IF('ND-CPA-305'!$A$12=\"X\",IF(E12=\"G\",3,IF(E12=\"F\",2,1)),0)","v":0},{"$f":"IF('ND-CPA-305'!$A$13=\"X\",IF(F12=\"G\",3,IF(F12=\"F\",2,1)),0)","v":0},{"$f":"IF('ND-CPA-305'!$F$10=\"X\",IF(G12=\"G\",3,IF(G12=\"F\",2,1)),0)","v":0},{"$f":"IF('ND-CPA-305'!$F$11=\"X\",IF(H12=\"G\",3,IF(H12=\"F\",2,1)),0)","v":0},null,{"$f":"IF('ND-CPA-305'!$F$14=\"X\",IF(J12=\"G\",3,IF(J12=\"F\",2,1)),0)","v":0},null,null,null,null,{"$f":"IF('ND-CPA-305'!$A$16=\"X\",IF(O12=\"G\",3,IF(O12=\"F\",2,1)),0)","v":0},null,{"$f":"IF('ND-CPA-305'!$F$13=\"X\",IF(Q12=\"Y\",3,0),0)","v":0},{"$f":"IF('ND-CPA-305'!$A$15=\"X\",IF(R12=\"G\",3,IF(R12=\"F\",2,1)),0)","v":0},{"$f":"IF('ND-CPA-305'!$F$16=\"X\",IF(S12=\"G\",3,IF(S12=\"F\",2,1)),0)","v":0},0]
["crimson clover","F","F","F","G","F","F","G","MM","F","F","CB",4,"0.25 - 0.75","P","L","Y","G","P",0,{"$f":"IF('ND-CPA-305'!$A$10=\"X\",IF(B13=\"G\",3,IF(B13=\"F\",2,1)),0)","v":0},{"$f":"IF('ND-CPA-305'!$A$14=\"X\",IF(C13=\"G\",3,IF(C13=\"F\",2,1)),0)","v":0},{"$f":"IF('ND-CPA-305'!$F$15=\"X\",IF(D13=\"G\",3,IF(D13=\"F\",2,1)),0)","v":0},{"$f":"IF('ND-CPA-305'!$A$12=\"X\",IF(E13=\"G\",3,IF(E13=\"F\",2,1)),0)","v":0},{"$f":"IF('ND-CPA-305'!$A$13=\"X\",IF(F13=\"G\",3,IF(F13=\"F\",2,1)),0)","v":0},{"$f":"IF('ND-CPA-305'!$F$10=\"X\",IF(G13=\"G\",3,IF(G13=\"F\",2,1)),0)","v":0},{"$f":"IF('ND-CPA-305'!$F$11=\"X\",IF(H13=\"G\",3,IF(H13=\"F\",2,1)),0)","v":0},null,{"$f":"IF('ND-CPA-305'!$F$14=\"X\",IF(J13=\"G\",3,IF(J13=\"F\",2,1)),0)","v":0},null,null,null,null,{"$f":"IF('ND-CPA-305'!$A$16=\"X\",IF(O13=\"G\",3,IF(O13=\"F\",2,1)),0)","v":0},null,{"$f":"IF('ND-CPA-305'!$F$13=\"X\",IF(Q13=\"Y\",3,0),0)","v":0},{"$f":"IF('ND-CPA-305'!$A$15=\"X\",IF(R13=\"G\",3,IF(R13=\"F\",2,1)),0)","v":0},{"$f":"IF('ND-CPA-305'!$F$16=\"X\",IF(S13=\"G\",3,IF(S13=\"F\",2,1)),0)","v":0},0]
["flax","F","F","F","P","P","P","P","SM","P","F","CB",50,"0.25 - 0.75","P","H","Y","G","G",0,{"$f":"IF('ND-CPA-305'!$A$10=\"X\",IF(B14=\"G\",3,IF(B14=\"F\",2,1)),0)","v":0},{"$f":"IF('ND-CPA-305'!$A$14=\"X\",IF(C14=\"G\",3,IF(C14=\"F\",2,1)),0)","v":0},{"$f":"IF('ND-CPA-305'!$F$15=\"X\",IF(D14=\"G\",3,IF(D14=\"F\",2,1)),0)","v":0},{"$f":"IF('ND-CPA-305'!$A$12=\"X\",IF(E14=\"G\",3,IF(E14=\"F\",2,1)),0)","v":0},{"$f":"IF('ND-CPA-305'!$A$13=\"X\",IF(F14=\"G\",3,IF(F14=\"F\",2,1)),0)","v":0},{"$f":"IF('ND-CPA-305'!$F$10=\"X\",IF(G14=\"G\",3,IF(G14=\"F\",2,1)),0)","v":0},{"$f":"IF('ND-CPA-305'!$F$11=\"X\",IF(H14=\"G\",3,IF(H14=\"F\",2,1)),0)","v":0},null,{"$f":"IF('ND-CPA-305'!$F$14=\"X\",IF(J14=\"G\",3,IF(J14=\"F\",2,1)),0)","v":0},null,null,null,null,{"$f":"IF('ND-CPA-305'!$A$16=\"X\",IF(O14=\"G\",3,IF(O14=\"F\",2,1)),0)","v":0},null,{"$f":"IF('ND-CPA-305'!$F$13=\"X\",IF(Q14=\"Y\",3,0),0)","v":0},{"$f":"IF('ND-CPA-305'!$A$15=\"X\",IF(R14=\"G\",3,IF(R14=\"F\",2,1)),0)","v":0},{"$f":"IF('ND-CPA-305'!$F$16=\"X\",IF(S14=\"G\",3,IF(S14=\"F\",2,1)),0)","v":0},0]
["hairy vetch","G","F","F","G","P","F","F","SM","F","L","WB",20,"0.5 - 1.5","P","L","Y","F","G",0,{"$f":"IF('ND-CPA-305'!$A$10=\"X\",IF(B15=\"G\",3,IF(B15=\"F\",2,1)),0)","v":0},{"$f":"IF('ND-CPA-305'!$A$14=\"X\",IF(C15=\"G\",3,IF(C15=\"F\",2,1)),0)","v":0},{"$f":"IF('ND-CPA-305'!$F$15=\"X\",IF(D15=\"G\",3,IF(D15=\"F\",2,1)),0)","v":0},{"$f":"IF('ND-CPA-305'!$A$12=\"X\",IF(E15=\"G\",3,IF(E15=\"F\",2,1)),0)","v":0},{"$f":"IF('ND-CPA-305'!$A$13=\"X\",IF(F15=\"G\",3,IF(F15=\"F\",2,1)),0)","v":0},{"$f":"IF('ND-CPA-305'!$F$10=\"X\",IF(G15=\"G\",3,IF(G15=\"F\",2,1)),0)","v":0},{"$f":"IF('ND-CPA-305'!$F$11=\"X\",IF(H15=\"G\",3,IF(H15=\"F\",2,1)),0)","v":0},null,{"$f":"IF('ND-CPA-305'!$F$14=\"X\",IF(J15=\"G\",3,IF(J15=\"F\",2,1)),0)","v":0},null,null,null,null,{"$f":"IF('ND-CPA-305'!$A$16=\"X\",IF(O15=\"G\",3,IF(O15=\"F\",2,1)),0)","v":0},null,{"$f":"IF('ND-CPA-305'!$F$13=\"X\",IF(Q15=\"Y\",3,0),0)","v":0},{"$f":"IF('ND-CPA-305'!$A$15=\"X\",IF(R15=\"G\",3,IF(R15=\"F\",2,1)),0)","v":0},{"$f":"IF('ND-CPA-305'!$F$16=\"X\",IF(S15=\"G\",3,IF(S15=\"F\",2,1)),0)","v":0},0]
{"$rows_left_out":52}
{"sheet":"Photos Sheet","index":3,"n_rows":1,"n_cols":1,"rows_kept":1,"cut":false,"hidden":false,"merged":[[0,0,0,7]]}
["Insert pictures, photos of the cover crop(s), optional documentation."]

{"sheet":"ND-Frost Dates","index":4,"n_rows":51,"n_cols":6,"rows_kept":51,"cut":false,"hidden":false,"merged":[[51,0,51,4],[6,0,6,4],[7,0,7,4],[8,0,8,4],[9,1,9,2],[9,3,9,4]]}
["ProCrop "]
[]
[]
[]
[]
[]
[]
["Average Date of Last Spring Frost and First Fall Frost in North Dakota"]
[]
["Station & County","Average Date of Last Spring Frost",null,"Average Date of First Fall Frost"]
[null,"28 F","32 F","32 F","28 F"]
["Crosby - Divide","2013-05-10","2013-05-18","2013-09-16","2013-09-23","Northwest District"]
["Minot Exp - Ward","2013-05-12","2013-05-20","2013-09-17","2013-09-26"]
["Mohall - Renville","2013-05-11","2013-05-18","2013-09-16","2013-09-23"]
["Parshall - Mountrail","2013-05-15","2013-05-21","2013-09-12","2013-09-18"]
{"$rows_left_out":36}